Target
Interleukin-1 beta
Ligand
BDBM531282
Substrate
Meas. Tech.
IL-1 Secretion Assa
IC50
3.00±n/a nM
Citation
 Farady, CGommermann, NJanser, PMackay, AMattes, HSmith, NSolovay, CFStiefl, NJVangrevelinghe, EVelcicky, Jvon Matt, A NLRP3 inflammasome inhibitors US Patent  US11208399 Publication Date 12/28/2021 
Target
Name:
Interleukin-1 beta
Synonyms:
IL1B IL1F2 Interleukin-1 beta | hIL-1beta
Type:
Cytokine
Mol. Mass.:
30734.47
Organism:
Homo sapiens (Human)
Description:
P01584
Residue:
269
  
Inhibitor
Name:
BDBM531282
Synonyms:
US11208399, Example 41
Type:
Small organic molecule
Emp. Form.:
C18H19F3N4O3
Mol. Mass.:
396.3637
SMILES:
Cc1cc(cc(O)c1-c1ccc(NC2CCC(NC2)C(O)=O)nn1)C(F)(F)F
: