Target
Interleukin-1 beta
Ligand
BDBM531331
Substrate
Meas. Tech.
IL-1 Secretion Assa
IC50
0.700±n/a nM
Citation
 Farady, CGommermann, NJanser, PMackay, AMattes, HSmith, NSolovay, CFStiefl, NJVangrevelinghe, EVelcicky, Jvon Matt, A NLRP3 inflammasome inhibitors US Patent  US11208399 Publication Date 12/28/2021 
Target
Name:
Interleukin-1 beta
Synonyms:
IL1B IL1F2 Interleukin-1 beta | hIL-1beta
Type:
Cytokine
Mol. Mass.:
30734.47
Organism:
Homo sapiens (Human)
Description:
P01584
Residue:
269
  
Inhibitor
Name:
BDBM531331
Synonyms:
US11208399, Example 82
Type:
Small organic molecule
Emp. Form.:
C18H21F3N4O2
Mol. Mass.:
382.3801
SMILES:
CN1CCC[C@H](C1)Nc1cc(C)c(nn1)-c1ccc(OC(F)(F)F)cc1O
: