Target
Interleukin-1 beta
Ligand
BDBM531350
Substrate
Meas. Tech.
IL-1 Secretion Assa
IC50
3.30±n/a nM
Citation
 Farady, CGommermann, NJanser, PMackay, AMattes, HSmith, NSolovay, CFStiefl, NJVangrevelinghe, EVelcicky, Jvon Matt, A NLRP3 inflammasome inhibitors US Patent  US11208399 Publication Date 12/28/2021 
Target
Name:
Interleukin-1 beta
Synonyms:
IL1B IL1F2 Interleukin-1 beta | hIL-1beta
Type:
Cytokine
Mol. Mass.:
30734.47
Organism:
Homo sapiens (Human)
Description:
P01584
Residue:
269
  
Inhibitor
Name:
BDBM531350
Synonyms:
2-(6-(((R)-1-((S)-2-Hydroxypropyl)piperidin-3-yl)amino)pyridazin-3-yl)-3-methyl-5-(trifluoromethyl)phenol | US11208399, Example 92a
Type:
Small organic molecule
Emp. Form.:
C20H25F3N4O2
Mol. Mass.:
410.4333
SMILES:
C[C@H](O)CN1CCC[C@H](C1)Nc1ccc(nn1)-c1c(C)cc(cc1O)C(F)(F)F
: