Target
Interleukin-1 beta
Ligand
BDBM531354
Substrate
Meas. Tech.
IL-1 Secretion Assa
IC50
1.60±n/a nM
Citation
 Farady, CGommermann, NJanser, PMackay, AMattes, HSmith, NSolovay, CFStiefl, NJVangrevelinghe, EVelcicky, Jvon Matt, A NLRP3 inflammasome inhibitors US Patent  US11208399 Publication Date 12/28/2021 
Target
Name:
Interleukin-1 beta
Synonyms:
IL1B IL1F2 Interleukin-1 beta | hIL-1beta
Type:
Cytokine
Mol. Mass.:
30734.47
Organism:
Homo sapiens (Human)
Description:
P01584
Residue:
269
  
Inhibitor
Name:
BDBM531354
Synonyms:
2-(6-(((3S, 5S)-5-Fluoro-1-methylpiperidin-3-yl)amino)pyridazin-3-yl)-3-methyl-5-(trifluoro methyl)phenol | US11208399, Example 94a
Type:
Small organic molecule
Emp. Form.:
C18H20F4N4O
Mol. Mass.:
384.3712
SMILES:
CN1C[C@@H](F)C[C@@H](C1)Nc1ccc(nn1)-c1c(C)cc(cc1O)C(F)(F)F
: