Target
Phosphatidylinositol 3-kinase catalytic subunit type 3
Ligand
BDBM532279
Substrate
Meas. Tech.
Vps34 Biochemical Assay
IC50
<5.00±n/a nM
Citation
 Lindström, JForsblom, RGinman, TRahm, FViklund, J Pyridinamine-pyridone and pyrimidinamine- pyridone compounds US Patent  US11208423 Publication Date 12/28/2021 
Target
Name:
Phosphatidylinositol 3-kinase catalytic subunit type 3
Synonyms:
BC033004 PIK3C3 Phosphatidylinositol 3-kinase catalytic subunit type 3 (PIK3C3) Phosphoinositide 3-Kinase (PI3K), Vps34 PtdIns-3-kinase type 3 hVPS34
Type:
Enzyme
Mol. Mass.:
101551.30
Organism:
Homo sapiens (Human)
Description:
Recombinant human Vps34 protein was expressed as monomeric GST-fusion and purified.
Residue:
887
  
Inhibitor
Name:
BDBM532279
Synonyms:
6-[1-Ethyl-3-(trifluoromethyl)pyrazol-4-yl]-4-[2-[(2-methylpyrimidin-4-yl)amino]-4-pyridyl]-1H-pyridin-2-one US11780858, Example 59
Type:
Small organic molecule
Emp. Form.:
C21H18F3N7O
Mol. Mass.:
441.4091
SMILES:
CCn1cc(c(n1)C(F)(F)F)-c1cc(cc(=O)[nH]1)-c1ccnc(Nc2ccnc(C)n2)c1
: