Target
Phosphatidylinositol 3-kinase catalytic subunit type 3
Ligand
BDBM532281
Substrate
Meas. Tech.
Vps34 Biochemical Assay
IC50
<5.00±n/a nM
Citation
 Lindström, JForsblom, RGinman, TRahm, FViklund, J Pyridinamine-pyridone and pyrimidinamine- pyridone compounds US Patent  US11208423 Publication Date 12/28/2021 
Target
Name:
Phosphatidylinositol 3-kinase catalytic subunit type 3
Synonyms:
BC033004 PIK3C3 Phosphatidylinositol 3-kinase catalytic subunit type 3 (PIK3C3) Phosphoinositide 3-Kinase (PI3K), Vps34 PtdIns-3-kinase type 3 hVPS34
Type:
Enzyme
Mol. Mass.:
101551.30
Organism:
Homo sapiens (Human)
Description:
Recombinant human Vps34 protein was expressed as monomeric GST-fusion and purified.
Residue:
887
  
Inhibitor
Name:
BDBM532281
Synonyms:
6-(2-Chlorophenyl)-4-[2-[(2-methylpyrimidin-4-yl)amino]-4-pyridyl]-1H-pyridin-2-one US11780858, Example 66
Type:
Small organic molecule
Emp. Form.:
C21H16ClN5O
Mol. Mass.:
389.838
SMILES:
Cc1nccc(Nc2cc(ccn2)-c2cc([nH]c(=O)c2)-c2ccccc2Cl)n1
: