Target
Phosphatidylinositol 3-kinase catalytic subunit type 3
Ligand
BDBM532967
Substrate
Meas. Tech.
Biochemical Assay
IC50
<5.00±n/a nM
Citation
 Lindström, JForsblom, RGinman, TRahm, FViklund, J Pyridylpyridone compounds US Patent  US11219618 Publication Date 1/11/2022 
Target
Name:
Phosphatidylinositol 3-kinase catalytic subunit type 3
Synonyms:
BC033004 PIK3C3 Phosphatidylinositol 3-kinase catalytic subunit type 3 (PIK3C3) Phosphoinositide 3-Kinase (PI3K), Vps34 PtdIns-3-kinase type 3 hVPS34
Type:
Enzyme
Mol. Mass.:
101551.30
Organism:
Homo sapiens (Human)
Description:
Recombinant human Vps34 protein was expressed as monomeric GST-fusion and purified.
Residue:
887
  
Inhibitor
Name:
BDBM532967
Synonyms:
N-[4-[2-(4-methyl-3-pyridyl)-6-oxo-1H-pyridin-4-yl]-2-pyridyl]acetamide | US11219618, Example 40
Type:
Small organic molecule
Emp. Form.:
C18H16N4O2
Mol. Mass.:
320.3452
SMILES:
CC(=O)Nc1cc(ccn1)-c1cc([nH]c(=O)c1)-c1cnccc1C
: