Target
Oxysterols receptor LXR-beta
Ligand
BDBM304402
Substrate
Meas. Tech.
LXR alpha/beta Radioligand Binding Assay
Ki
5.00±n/a nM
Citation
 Claremon, DADong, CFan, YLeftheris, KLotesta, SDSingh, SBTice, CMZhao, WZheng, YZhuang, L Piperazine derivatives as liver X receptor modulators US Patent  US10144715 Publication Date 12/4/2018 
Target
Name:
Oxysterols receptor LXR-beta
Synonyms:
LXRB Liver X, LXR beta NR1H2 Nuclear receptor NER Ubiquitously-expressed nuclear receptor
Type:
Enzyme Catalytic Domain
Mol. Mass.:
50978.79
Organism:
Homo sapiens (Human)
Description:
P55055
Residue:
460
  
Inhibitor
Name:
BDBM304402
Synonyms:
(R)-2-fluoro-5-(4-(5-(2-hydroxypropan-2-yl)-4-(trifluoromethyl)pyrimidin-2-yl)-3-isopropylpiperazin-1-yl)-N-methylbenzenesulfonamide | US10144715, Compound 10-3
Type:
Small organic molecule
Emp. Form.:
C22H29F4N5O3S
Mol. Mass.:
519.556
SMILES:
CNS(=O)(=O)c1cc(ccc1F)N1CCN([C@@H](C1)C(C)C)c1ncc(c(n1)C(F)(F)F)C(C)(C)O
: