Target
Oxysterols receptor LXR-beta
Ligand
BDBM304431
Substrate
Meas. Tech.
LXR alpha/beta Radioligand Binding Assay
Ki
3.00±n/a nM
Citation
 Claremon, DADong, CFan, YLeftheris, KLotesta, SDSingh, SBTice, CMZhao, WZheng, YZhuang, L Piperazine derivatives as liver X receptor modulators US Patent  US10144715 Publication Date 12/4/2018 
Target
Name:
Oxysterols receptor LXR-beta
Synonyms:
LXRB Liver X, LXR beta NR1H2 Nuclear receptor NER Ubiquitously-expressed nuclear receptor
Type:
Enzyme Catalytic Domain
Mol. Mass.:
50978.79
Organism:
Homo sapiens (Human)
Description:
P55055
Residue:
460
  
Inhibitor
Name:
BDBM304431
Synonyms:
1-(2-((R)-4-(4-fluoro-3-(methylsulfonyl)phenyl)-2-isopropylpiperazin-1-yl)-4-(trifluoromethyl)pyrimidin-5-yl)ethan-1-ol US10144715, Compound 13-1
Type:
Small organic molecule
Emp. Form.:
C21H26F4N4O3S
Mol. Mass.:
490.515
SMILES:
CC(C)[C@@H]1CN(CCN1c1ncc(C(C)O)c(n1)C(F)(F)F)c1ccc(F)c(c1)S(C)(=O)=O
: