Target
Oxysterols receptor LXR-beta
Ligand
BDBM304509
Substrate
Meas. Tech.
LXR alpha/beta Radioligand Binding Assay
Ki
4.00±n/a nM
Citation
 Claremon, DADong, CFan, YLeftheris, KLotesta, SDSingh, SBTice, CMZhao, WZheng, YZhuang, L Piperazine derivatives as liver X receptor modulators US Patent  US10144715 Publication Date 12/4/2018 
Target
Name:
Oxysterols receptor LXR-beta
Synonyms:
LXRB Liver X, LXR beta NR1H2 Nuclear receptor NER Ubiquitously-expressed nuclear receptor
Type:
Enzyme Catalytic Domain
Mol. Mass.:
50978.79
Organism:
Homo sapiens (Human)
Description:
P55055
Residue:
460
  
Inhibitor
Name:
BDBM304509
Synonyms:
(R)-2-(2-(4-(4-(hydroxymethyl)-3-(methylsulfonyl)phenyl)-2-isopropylpiperazin-1-yl)-4-(trifluoromethyl)pyrimidin-5-yl)-2-methylpropanenitrile | US10144715, Compound 25-1
Type:
Small organic molecule
Emp. Form.:
C25H32F3N5O3S
Mol. Mass.:
539.613
SMILES:
CC(C)[C@@H]1CN(CCN1c1ncc(c(n1)C(F)(F)F)C(C)(C)C#N)c1ccc(CCO)c(c1)S(C)(=O)=O
: