Target
Oxysterols receptor LXR-beta
Ligand
BDBM304523
Substrate
Meas. Tech.
LXR alpha/beta Radioligand Binding Assay
Ki
2.00±n/a nM
Citation
 Claremon, DADong, CFan, YLeftheris, KLotesta, SDSingh, SBTice, CMZhao, WZheng, YZhuang, L Piperazine derivatives as liver X receptor modulators US Patent  US10144715 Publication Date 12/4/2018 
Target
Name:
Oxysterols receptor LXR-beta
Synonyms:
LXRB Liver X, LXR beta NR1H2 Nuclear receptor NER Ubiquitously-expressed nuclear receptor
Type:
Enzyme Catalytic Domain
Mol. Mass.:
50978.79
Organism:
Homo sapiens (Human)
Description:
P55055
Residue:
460
  
Inhibitor
Name:
BDBM304523
Synonyms:
(R)-2-isopropyl-1-(6-methyl-5-(trifluoromethyl)pyridin-2-yl)-4-(3-(methylsulfonyl)phenyl)piperazine | US10144715, Compound 37-2
Type:
Small organic molecule
Emp. Form.:
C21H26F3N3O2S
Mol. Mass.:
441.51
SMILES:
CC(C)[C@@H]1CN(CCN1c1ccc(c(C)n1)C(F)(F)F)c1cccc(c1)S(C)(=O)=O
: