Target
Oxysterols receptor LXR-beta
Ligand
BDBM304525
Substrate
Meas. Tech.
LXR alpha/beta Radioligand Binding Assay
Ki
2.00±n/a nM
Citation
 Claremon, DADong, CFan, YLeftheris, KLotesta, SDSingh, SBTice, CMZhao, WZheng, YZhuang, L Piperazine derivatives as liver X receptor modulators US Patent  US10144715 Publication Date 12/4/2018 
Target
Name:
Oxysterols receptor LXR-beta
Synonyms:
LXRB Liver X, LXR beta NR1H2 Nuclear receptor NER Ubiquitously-expressed nuclear receptor
Type:
Enzyme Catalytic Domain
Mol. Mass.:
50978.79
Organism:
Homo sapiens (Human)
Description:
P55055
Residue:
460
  
Inhibitor
Name:
BDBM304525
Synonyms:
(R)-2-(2-(4-(4-fluoro-3-(methylsulfonyl)phenyl)-2-isopropylpiperazin-1-yl)-5-(trifluoromethyl)pyrimidin-4-yl)propan-2-ol | US10144715, Compound 39-1
Type:
Small organic molecule
Emp. Form.:
C22H28F4N4O3S
Mol. Mass.:
504.541
SMILES:
CC(C)[C@@H]1CN(CCN1c1ncc(c(n1)C(C)(C)O)C(F)(F)F)c1ccc(F)c(c1)S(C)(=O)=O
: