Target
Tyrosine-protein kinase JAK3
Ligand
BDBM539139
Substrate
Meas. Tech.
Biochemical JAK Kinase Assay
Ki
0.160±n/a nM
Citation
 Fatheree, PRBrandt, GESmith, CSullivan, SDVan Orden, LJ Fused imidazo-piperidine JAK inhibitors US Patent  US11254669 Publication Date 2/22/2022 
Target
Name:
Tyrosine-protein kinase JAK3
Synonyms:
JAK-3 JAK3_HUMAN Janus kinase 3 (JAK3) L-JAK | Leukocyte janus kinase
Type:
Protein
Mol. Mass.:
125111.08
Organism:
Homo sapiens (Human)
Description:
P52333
Residue:
1124
  
Inhibitor
Name:
BDBM539139
Synonyms:
US11254669, Example 1-2
Type:
Small organic molecule
Emp. Form.:
C27H30FN7O2
Mol. Mass.:
503.5712
SMILES:
CCc1cc(O)c(F)cc1-c1ccc2c(n[nH]c2c1)-c1nc2CC(NCc2[nH]1)C(=O)N1CCN(C)CC1
: