Target
Tyrosine-protein kinase JAK1
Ligand
BDBM472917
Substrate
Meas. Tech.
Biochemical JAK Kinase Assay
Ki
0.060±n/a nM
Citation
 Fatheree, PRBrandt, GESmith, CSullivan, SDVan Orden, LJ Fused imidazo-piperidine JAK inhibitors US Patent  US11254669 Publication Date 2/22/2022 
Target
Name:
Tyrosine-protein kinase JAK1
Synonyms:
JAK-1 JAK1A JAK1_HUMAN Janus kinase 1 (JAK1) | Janus kinase 1 JAK1
Type:
Protein
Mol. Mass.:
133293.73
Organism:
Homo sapiens (Human)
Description:
P23458
Residue:
1154
  
Inhibitor
Name:
BDBM472917
Synonyms:
US10836763, Example C-3 US11667637, Example 2-15 | US11713315, Example C-3
Type:
Small organic molecule
Emp. Form.:
C29H34FN7O2
Mol. Mass.:
531.6244
SMILES:
CCc1cc(O)c(F)cc1-c1ccc2c(n[nH]c2c1)-c1nc2C[C@H](N(C)Cc2[nH]1)C(=O)N1CCN(C)C[C@@H]1C
: