Target
Epidermal growth factor receptor [T790M,L858R]
Ligand
BDBM50555575
Substrate
Meas. Tech.
Biological Activity Assay
IC50
<0.300±n/a nM
Citation
 Wang, YLi, H Aminopyrimidine compound and composition comprising same and use thereof US Patent  US11267810 Publication Date 3/8/2022 
Target
Name:
Epidermal growth factor receptor [T790M,L858R]
Synonyms:
EGFR EGFR_HUMAN ERBB1 Epidermal growth factor receptor (EGFR)(T790M/L858R) Epidermal growth factor receptor (T790M, L858R) Epidermal growth factor receptor(L858R, T790M) | HER1
Type:
Mol. Mass.:
134353.72
Organism:
Homo sapiens (Human)
Description:
P00533[T790M,L858R]
Residue:
1210
  
Inhibitor
Name:
BDBM50555575
Synonyms:
C-18112003-G GNS1480 Lazertinib YH-25448 | Yh25448
Type:
Small organic molecule
Emp. Form.:
C30H34N8O3
Mol. Mass.:
554.6428
SMILES:
COc1cc(N2CCOCC2)c(NC(=O)C=C)cc1Nc1nccc(n1)-n1cc(CN(C)C)c(n1)-c1ccccc1
: