Target
Eukaryotic translation initiation factor 4E-binding protein 1
Ligand
BDBM545293
Substrate
Meas. Tech.
Fluorescence Polarization Assay
IC50
3.12±n/a nM
Citation
 Sperry, SXiang, AXErnst, JTReich, SHSprengeler, PAShaghafi, MMichels, TNilewski, CTran, CVPackard, GKGrubbs, AUrkalan, KMukaiyama, T EIF4E-inhibiting compounds and methods US Patent  US11286268 Publication Date 3/29/2022 
Target
Name:
Eukaryotic translation initiation factor 4E-binding protein 1
Synonyms:
4EBP1_HUMAN GFP-4EBP Green fluorescent protein-Eukaryotic initiation factor 4E (eIF4E) binding protein
Type:
Fusion protein
Mol. Mass.:
12578.35
Organism:
Homo sapiens (Human)
Description:
Residue:
118
  
Inhibitor
Name:
BDBM545293
Synonyms:
US11286268, Compound 781
Type:
Small organic molecule
Emp. Form.:
C29H23ClF3N5O5S
Mol. Mass.:
646.037
SMILES:
CN(C)C(=O)c1nc2c(cc1C(F)(F)F)nc(C)n(CCOc1ccc(Cl)cc1-c1cc(C)nc3c(csc13)C(O)=O)c2=O
: