Target
Eukaryotic translation initiation factor 4E-binding protein 1
Ligand
BDBM545305
Substrate
Meas. Tech.
Fluorescence Polarization Assay
IC50
2.44±n/a nM
Citation
 Sperry, SXiang, AXErnst, JTReich, SHSprengeler, PAShaghafi, MMichels, TNilewski, CTran, CVPackard, GKGrubbs, AUrkalan, KMukaiyama, T EIF4E-inhibiting compounds and methods US Patent  US11286268 Publication Date 3/29/2022 
Target
Name:
Eukaryotic translation initiation factor 4E-binding protein 1
Synonyms:
4EBP1_HUMAN GFP-4EBP Green fluorescent protein-Eukaryotic initiation factor 4E (eIF4E) binding protein
Type:
Fusion protein
Mol. Mass.:
12578.35
Organism:
Homo sapiens (Human)
Description:
Residue:
118
  
Inhibitor
Name:
BDBM545305
Synonyms:
US11286268, Compound 792
Type:
Small organic molecule
Emp. Form.:
C26H17Cl2N5O4S
Mol. Mass.:
566.415
SMILES:
Cc1cc(-c2cc(Cl)ccc2OCCn2c(C)nc3cnc(Cl)c(C#N)c3c2=O)c2scc(C(O)=O)c2n1
: