Target
Eukaryotic translation initiation factor 4E-binding protein 1
Ligand
BDBM545511
Substrate
Meas. Tech.
Fluorescence Polarization Assay
IC50
2.37±n/a nM
Citation
 Sperry, SXiang, AXErnst, JTReich, SHSprengeler, PAShaghafi, MMichels, TNilewski, CTran, CVPackard, GKGrubbs, AUrkalan, KMukaiyama, T EIF4E-inhibiting compounds and methods US Patent  US11286268 Publication Date 3/29/2022 
Target
Name:
Eukaryotic translation initiation factor 4E-binding protein 1
Synonyms:
4EBP1_HUMAN GFP-4EBP Green fluorescent protein-Eukaryotic initiation factor 4E (eIF4E) binding protein
Type:
Fusion protein
Mol. Mass.:
12578.35
Organism:
Homo sapiens (Human)
Description:
Residue:
118
  
Inhibitor
Name:
BDBM545511
Synonyms:
US11286268, Compound 1002
Type:
Small organic molecule
Emp. Form.:
C29H24ClN5O4S
Mol. Mass.:
574.05
SMILES:
CN(C)c1ncc2cc(C)n(CCOc3ccc(Cl)cc3-c3cc(C)nc4c(csc34)C(O)=O)c(=O)c2c1C#N
: