Target
Phosphatidylinositol 3-kinase catalytic subunit type 3
Ligand
BDBM548265
Substrate
Meas. Tech.
VPS34 ADP-Glo kinase assay
IC50
84±n/a nM
Citation
 Snahel, PMichael, SShumei, WHuifen, CX., HD SUBSTITUTED MORPHOLINE COMPOUNDS WIPO 0:0 (2022) Target
Name:
Phosphatidylinositol 3-kinase catalytic subunit type 3
Synonyms:
BC033004 PIK3C3 Phosphatidylinositol 3-kinase catalytic subunit type 3 (PIK3C3) Phosphoinositide 3-Kinase (PI3K), Vps34 PtdIns-3-kinase type 3 hVPS34
Type:
Enzyme
Mol. Mass.:
101551.30
Organism:
Homo sapiens (Human)
Description:
Recombinant human Vps34 protein was expressed as monomeric GST-fusion and purified.
Residue:
887
  
Inhibitor
Name:
BDBM548265
Synonyms:
(R)-7'-cyclopropyl-2'-((R)-3-methylmorpholino)-7'H-spiro[cyclopropane-1,6'-pyrazolo[1,5-a]pyrazin]-4'(5'H)-one | WO2022093820, Compound 31
Type:
Small organic molecule
Emp. Form.:
C16H22N4O2
Mol. Mass.:
302.3715
SMILES:
C[C@@H]1COCCN1c1cc2C(=O)NC3(CC3)[C@@H](C3CC3)n2n1
: