Target
Phosphatidylinositol 3-kinase catalytic subunit type 3
Ligand
BDBM548267
Substrate
Meas. Tech.
VPS34 ADP-Glo kinase assay
IC50
24±n/a nM
Citation
 Snahel, PMichael, SShumei, WHuifen, CX., HD SUBSTITUTED MORPHOLINE COMPOUNDS WIPO 0:0 (2022) Target
Name:
Phosphatidylinositol 3-kinase catalytic subunit type 3
Synonyms:
BC033004 PIK3C3 Phosphatidylinositol 3-kinase catalytic subunit type 3 (PIK3C3) Phosphoinositide 3-Kinase (PI3K), Vps34 PtdIns-3-kinase type 3 hVPS34
Type:
Enzyme
Mol. Mass.:
101551.30
Organism:
Homo sapiens (Human)
Description:
Recombinant human Vps34 protein was expressed as monomeric GST-fusion and purified.
Residue:
887
  
Inhibitor
Name:
BDBM548267
Synonyms:
(R)-7'-isopropyl-2'-((R)-3-methylmorpholino)-7'H-spiro[cyclopropane-1,6'-pyrazolo[1,5-a]pyrazin]-4'(5'H)-one | WO2022093820, Compound 33
Type:
Small organic molecule
Emp. Form.:
C16H24N4O2
Mol. Mass.:
304.3874
SMILES:
CC(C)[C@H]1n2nc(cc2C(=O)NC11CC1)N1CCOC[C@H]1C
: