Target
Leucine-rich repeat serine/threonine-protein kinase 2 [G2019S]
Ligand
BDBM548482
Substrate
Meas. Tech.
LRRK2 Km ATP LanthaScreen Assay
IC50
0.08±n/a nM
Citation
 H., FPAnmol, GD., KSH., KMA., MKXin, Y N-LINKED ISOQUINOLINE AMIDES AS LRRK2 INHIBITORS, PHARMACEUTICAL COMPOSITIONS, AND USES THEREOF WIPO 0:0 (2022) Target
Name:
Leucine-rich repeat serine/threonine-protein kinase 2 [G2019S]
Synonyms:
LRRK2 LRRK2_HUMAN Leucine-rich repeat serine/threonine-protein kinase 2 (LRRK2)(G2019S) PARK8
Type:
Mol. Mass.:
286143.23
Organism:
Homo sapiens (Human)
Description:
Q5S007(G2019S)
Residue:
2527
  
Inhibitor
Name:
BDBM548482
Synonyms:
WO2022093881, Ex-9.12
Type:
Small organic molecule
Emp. Form.:
C28H36N6O2
Mol. Mass.:
488.6244
SMILES:
C[C@H]1[C@H](C1c1cnn(C)c1)C(=O)Nc1cc2cc(N3CCN(CC3)C3(C)CCOC3)c(C)cc2cn1
: