Target
Leucine-rich repeat serine/threonine-protein kinase 2 [G2019S]
Ligand
BDBM548553
Substrate
Meas. Tech.
LRRK2 Km ATP LanthaScreen Assay
IC50
0.08±n/a nM
Citation
 H., FPAnmol, GD., KSH., KMA., MKXin, Y N-LINKED ISOQUINOLINE AMIDES AS LRRK2 INHIBITORS, PHARMACEUTICAL COMPOSITIONS, AND USES THEREOF WIPO 0:0 (2022) Target
Name:
Leucine-rich repeat serine/threonine-protein kinase 2 [G2019S]
Synonyms:
LRRK2 LRRK2_HUMAN Leucine-rich repeat serine/threonine-protein kinase 2 (LRRK2)(G2019S) PARK8
Type:
Mol. Mass.:
286143.23
Organism:
Homo sapiens (Human)
Description:
Q5S007(G2019S)
Residue:
2527
  
Inhibitor
Name:
BDBM548553
Synonyms:
WO2022093881, Ex-10.62
Type:
Small organic molecule
Emp. Form.:
C27H29ClF4N6O2
Mol. Mass.:
581.005
SMILES:
Cn1ncc([C@@H]2C[C@H]2C(=O)Nc2cc3cc(N4CCN(CC4)[C@@]4(C)COC[C@H]4F)c(Cl)cc3cn2)c1C(F)(F)F
: