Target
Hsp90 chaperone protein kinase-targeting subunit
Ligand
BDBM551754
Substrate
Meas. Tech.
FP-based equilibrium competition assay
EC50
1756±n/a nM
Citation
 Brown, LEHuang, DSCowen, LEWhitesell, LMarcyk, P Hsp90 inhibitors and uses thereof US Patent  US11312722 Publication Date 4/26/2022 
Target
Name:
Hsp90 chaperone protein kinase-targeting subunit
Synonyms:
F5H9H0_CRYNB
Type:
Protein
Mol. Mass.:
57233.28
Organism:
Filobasidiella neoformans
Description:
F5H9H0
Residue:
505
  
Inhibitor
Name:
BDBM551754
Synonyms:
US11312722, Compound 44
Type:
Small organic molecule
Emp. Form.:
C33H30N4O4
Mol. Mass.:
546.6157
SMILES:
COc1ccc(Cn2ncc(Cc3ccccc3)c2Nc2cc(O)cc(O)c2C(=O)N2Cc3ccccc3C2)cc1
: