Target
Hsp90 chaperone protein kinase-targeting subunit
Ligand
BDBM551763
Substrate
Meas. Tech.
FP-based equilibrium competition assay
EC50
41.0±n/a nM
Citation
 Brown, LEHuang, DSCowen, LEWhitesell, LMarcyk, P Hsp90 inhibitors and uses thereof US Patent  US11312722 Publication Date 4/26/2022 
Target
Name:
Hsp90 chaperone protein kinase-targeting subunit
Synonyms:
F5H9H0_CRYNB
Type:
Protein
Mol. Mass.:
57233.28
Organism:
Filobasidiella neoformans
Description:
F5H9H0
Residue:
505
  
Inhibitor
Name:
BDBM551763
Synonyms:
US11312722, Compound 53
Type:
Small organic molecule
Emp. Form.:
C28H30N6O4
Mol. Mass.:
514.5756
SMILES:
COc1ccc(Cn2nc(cc2Nc2cc(O)cc(O)c2C(=O)N2Cc3cn[nH]c3C2)C2CCCC2)cc1
: