Target
Hsp90 chaperone protein kinase-targeting subunit
Ligand
BDBM551765
Substrate
Meas. Tech.
FP-based equilibrium competition assay
EC50
40.0±n/a nM
Citation
 Brown, LEHuang, DSCowen, LEWhitesell, LMarcyk, P Hsp90 inhibitors and uses thereof US Patent  US11312722 Publication Date 4/26/2022 
Target
Name:
Hsp90 chaperone protein kinase-targeting subunit
Synonyms:
F5H9H0_CRYNB
Type:
Protein
Mol. Mass.:
57233.28
Organism:
Filobasidiella neoformans
Description:
F5H9H0
Residue:
505
  
Inhibitor
Name:
BDBM551765
Synonyms:
US11312722, Compound 55
Type:
Small organic molecule
Emp. Form.:
C27H24N6O5
Mol. Mass.:
512.5167
SMILES:
COc1ccc(Cn2nc(cc2Nc2cc(O)cc(O)c2C(=O)N2Cc3cn[nH]c3C2)-c2ccoc2)cc1
: