Target
Lys-gingipain
Ligand
BDBM453289
Substrate
Meas. Tech.
Inhibition Activity Assay
IC50
<0.050±n/a nM
Citation
 Konradi, AWGalemmo, Jr., RADominy, SSLynch, CCHolsinger, LJ Ketone inhibitors of lysine gingipain US Patent  US11325884 Publication Date 5/10/2022 
Target
Name:
Lys-gingipain
Synonyms:
KGP_PORG3 kgp
Type:
Protein
Mol. Mass.:
187217.55
Organism:
Porphyromonas gingivalis
Description:
B2RLK2
Residue:
1723
  
Inhibitor
Name:
BDBM453289
Synonyms:
US10730826, Compound 2a | US11325884, Compound 2a
Type:
Small organic molecule
Emp. Form.:
C19H26F2N2O3
Mol. Mass.:
368.4181
SMILES:
NCCCCC(NC(=O)C1CCCC1)C(=O)COc1c(F)cccc1F
: