Target
Lys-gingipain
Ligand
BDBM453309
Substrate
Meas. Tech.
Inhibition Activity Assay
IC50
0.080±n/a nM
Citation
 Konradi, AWGalemmo, Jr., RADominy, SSLynch, CCHolsinger, LJ Ketone inhibitors of lysine gingipain US Patent  US11325884 Publication Date 5/10/2022 
Target
Name:
Lys-gingipain
Synonyms:
KGP_PORG3 kgp
Type:
Protein
Mol. Mass.:
187217.55
Organism:
Porphyromonas gingivalis
Description:
B2RLK2
Residue:
1723
  
Inhibitor
Name:
BDBM453309
Synonyms:
US10730826, Compound 10a US11325884, Compound 10a
Type:
Small organic molecule
Emp. Form.:
C22H25F2N3O4
Mol. Mass.:
433.4484
SMILES:
CC(=O)Nc1cccc(c1)C(=O)NC(CCCCN)C(=O)COc1c(F)cccc1F
: