Target
Lys-gingipain
Ligand
BDBM453331
Substrate
Meas. Tech.
Inhibition Activity Assay
IC50
0.120±n/a nM
Citation
 Konradi, AWGalemmo, Jr., RADominy, SSLynch, CCHolsinger, LJ Ketone inhibitors of lysine gingipain US Patent  US11325884 Publication Date 5/10/2022 
Target
Name:
Lys-gingipain
Synonyms:
KGP_PORG3 kgp
Type:
Protein
Mol. Mass.:
187217.55
Organism:
Porphyromonas gingivalis
Description:
B2RLK2
Residue:
1723
  
Inhibitor
Name:
BDBM453331
Synonyms:
BDBM553834 | US10730826, Compound 55a
Type:
Small organic molecule
Emp. Form.:
C16H19FN4O4
Mol. Mass.:
350.3449
SMILES:
NCCCCC(NC(=O)c1ccc(F)nc1)C(=O)COc1ccon1
: