Target
Lys-gingipain
Ligand
BDBM453342
Substrate
Meas. Tech.
Inhibition Activity Assay
IC50
0.080±n/a nM
Citation
 Konradi, AWGalemmo, Jr., RADominy, SSLynch, CCHolsinger, LJ Ketone inhibitors of lysine gingipain US Patent  US11325884 Publication Date 5/10/2022 
Target
Name:
Lys-gingipain
Synonyms:
KGP_PORG3 kgp
Type:
Protein
Mol. Mass.:
187217.55
Organism:
Porphyromonas gingivalis
Description:
B2RLK2
Residue:
1723
  
Inhibitor
Name:
BDBM453342
Synonyms:
BDBM553845 | US10730826, Compound 32a
Type:
Small organic molecule
Emp. Form.:
C19H20F3N3O3
Mol. Mass.:
395.3756
SMILES:
NCCCCC(NC(=O)c1cccnc1F)C(=O)COc1c(F)cccc1F
: