Target
Lys-gingipain
Ligand
BDBM453369
Substrate
Meas. Tech.
Inhibition Activity Assay
IC50
0.090±n/a nM
Citation
 Konradi, AWGalemmo, Jr., RADominy, SSLynch, CCHolsinger, LJ Ketone inhibitors of lysine gingipain US Patent  US11325884 Publication Date 5/10/2022 
Target
Name:
Lys-gingipain
Synonyms:
KGP_PORG3 kgp
Type:
Protein
Mol. Mass.:
187217.55
Organism:
Porphyromonas gingivalis
Description:
B2RLK2
Residue:
1723
  
Inhibitor
Name:
BDBM453369
Synonyms:
BDBM553871 | US10730826, Compound 63a
Type:
Small organic molecule
Emp. Form.:
C19H31N3O4
Mol. Mass.:
365.4671
SMILES:
COC(C)(C)C(=O)NC(CCCCN)C(=O)COc1cc(C)nc(C)c1
: