Target
Lys-gingipain
Ligand
BDBM453371
Substrate
Meas. Tech.
Inhibition Activity Assay
IC50
0.160±n/a nM
Citation
 Konradi, AWGalemmo, Jr., RADominy, SSLynch, CCHolsinger, LJ Ketone inhibitors of lysine gingipain US Patent  US11325884 Publication Date 5/10/2022 
Target
Name:
Lys-gingipain
Synonyms:
KGP_PORG3 kgp
Type:
Protein
Mol. Mass.:
187217.55
Organism:
Porphyromonas gingivalis
Description:
B2RLK2
Residue:
1723
  
Inhibitor
Name:
BDBM453371
Synonyms:
BDBM553873 | US10730826, Compound 65a
Type:
Small organic molecule
Emp. Form.:
C17H28N4O4
Mol. Mass.:
352.4286
SMILES:
COC(C)(C)C(=O)NC(CCCCN)C(=O)COc1cnc(C)nc1
: