Target
Bifunctional polynucleotide phosphatase/kinase
Ligand
BDBM553815
Substrate
Meas. Tech.
Steady-State Fluorescence Assay
Kd
250±n/a nM
Citation
 Hall, DWeinfeld, MBernard, SVerdelet, TMorgan, TLamontagne, VShire, ZLavasanifar, A Imidopiperidine compounds as inhibitors of human polynucleotide kinase phosphatase US Patent  US11325905 Publication Date 5/10/2022 
Target
Name:
Bifunctional polynucleotide phosphatase/kinase
Synonyms:
DNA 5'-kinase/3'-phosphatase PNKP_HUMAN | Polynucleotide kinase-3'-phosphatase
Type:
Protein
Mol. Mass.:
57085.26
Organism:
Human
Description:
Q96T60
Residue:
521
  
Inhibitor
Name:
BDBM553815
Synonyms:
US11325905, Compound A95B4C3
Type:
Small organic molecule
Emp. Form.:
C33H26N4O6
Mol. Mass.:
574.5827
SMILES:
O[C@H](C1C=CC2[C@H](N1Nc1ccc(cc1)N(=O)=O)C(=O)N(C2=O)c1ccccc1)c1ccc(cc1)C(=O)c1ccccc1
: