Target
Bifunctional polynucleotide phosphatase/kinase
Ligand
BDBM553878
Substrate
Meas. Tech.
Steady-State Fluorescence Assay
Kd
650±n/a nM
Citation
 Hall, DWeinfeld, MBernard, SVerdelet, TMorgan, TLamontagne, VShire, ZLavasanifar, A Imidopiperidine compounds as inhibitors of human polynucleotide kinase phosphatase US Patent  US11325905 Publication Date 5/10/2022 
Target
Name:
Bifunctional polynucleotide phosphatase/kinase
Synonyms:
DNA 5'-kinase/3'-phosphatase PNKP_HUMAN | Polynucleotide kinase-3'-phosphatase
Type:
Protein
Mol. Mass.:
57085.26
Organism:
Human
Description:
Q96T60
Residue:
521
  
Inhibitor
Name:
BDBM553878
Synonyms:
US11325905, Compound A26B4C10
Type:
Small organic molecule
Emp. Form.:
C34H31N5O5
Mol. Mass.:
589.6404
SMILES:
NCc1ccc(cc1)N1C(=O)C2C=CC([C@@H](O)C(c3ccccc3)c3ccccc3)N(Nc3ccc(cc3)N(=O)=O)[C@@H]2C1=O
: