Target
Bifunctional polynucleotide phosphatase/kinase
Ligand
BDBM553903
Substrate
Meas. Tech.
Steady-State Fluorescence Assay
IC50
7000±n/a nM
Citation
 Hall, DWeinfeld, MBernard, SVerdelet, TMorgan, TLamontagne, VShire, ZLavasanifar, A Imidopiperidine compounds as inhibitors of human polynucleotide kinase phosphatase US Patent  US11325905 Publication Date 5/10/2022 
Target
Name:
Bifunctional polynucleotide phosphatase/kinase
Synonyms:
DNA 5'-kinase/3'-phosphatase PNKP_HUMAN | Polynucleotide kinase-3'-phosphatase
Type:
Protein
Mol. Mass.:
57085.26
Organism:
Human
Description:
Q96T60
Residue:
521
  
Inhibitor
Name:
BDBM553903
Synonyms:
US11325905, Compound A12B4C63
Type:
Small organic molecule
Emp. Form.:
C35H42N4O5
Mol. Mass.:
598.7318
SMILES:
CCCCCCCCCC[C@H](O)C1C=CC2[C@H](N1Nc1ccc(cc1)N(=O)=O)C(=O)N(Cc1cccc3ccccc13)C2=O
: