Target
Bifunctional polynucleotide phosphatase/kinase
Ligand
BDBM553908
Substrate
Meas. Tech.
Steady-State Fluorescence Assay
IC50
39400±n/a nM
Citation
 Hall, DWeinfeld, MBernard, SVerdelet, TMorgan, TLamontagne, VShire, ZLavasanifar, A Imidopiperidine compounds as inhibitors of human polynucleotide kinase phosphatase US Patent  US11325905 Publication Date 5/10/2022 
Target
Name:
Bifunctional polynucleotide phosphatase/kinase
Synonyms:
DNA 5'-kinase/3'-phosphatase PNKP_HUMAN | Polynucleotide kinase-3'-phosphatase
Type:
Protein
Mol. Mass.:
57085.26
Organism:
Human
Description:
Q96T60
Residue:
521
  
Inhibitor
Name:
BDBM553908
Synonyms:
US11325905, Compound A12B12C3
Type:
Small organic molecule
Emp. Form.:
C31H38N4O3
Mol. Mass.:
514.6584
SMILES:
CCCCCCCCCC[C@H](O)C1C=CC2[C@H](N1Nc1ccc(cc1)C#N)C(=O)N(C2=O)c1ccccc1
: