Target
Bifunctional polynucleotide phosphatase/kinase
Ligand
BDBM553933
Substrate
Meas. Tech.
Steady-State Fluorescence Assay
IC50
19400±n/a nM
Citation
 Hall, DWeinfeld, MBernard, SVerdelet, TMorgan, TLamontagne, VShire, ZLavasanifar, A Imidopiperidine compounds as inhibitors of human polynucleotide kinase phosphatase US Patent  US11325905 Publication Date 5/10/2022 
Target
Name:
Bifunctional polynucleotide phosphatase/kinase
Synonyms:
DNA 5'-kinase/3'-phosphatase PNKP_HUMAN | Polynucleotide kinase-3'-phosphatase
Type:
Protein
Mol. Mass.:
57085.26
Organism:
Human
Description:
Q96T60
Residue:
521
  
Inhibitor
Name:
BDBM553933
Synonyms:
US11325905, Compound A83B37C63
Type:
Small organic molecule
Emp. Form.:
C33H29N3O6
Mol. Mass.:
563.5999
SMILES:
COc1ccccc1[C@@H](O)[C@H]1C=C[C@@H]2[C@H](N1Cc1ccc(cc1)N(=O)=O)C(=O)N(Cc1cccc3ccccc13)C2=O
: