Target
Replicase polyprotein 1a
Ligand
BDBM510063
Substrate
Meas. Tech.
SARS-CoV-2 Coronavirus 3C Protease FRET Assay
Ki
2.00±n/a nM
Citation
 Owen, DRPettersson, MYReese, MRSammons, MFTuttle, JBVerhoest, PRWei, LYang, QYang, X Nitrile-containing antiviral compounds US Patent  US11351149 Publication Date 6/7/2022 
Target
Name:
Replicase polyprotein 1a
Synonyms:
ORF1a polyprotein Replicase polyprotein 1a pp1a
Type:
Protein
Mol. Mass.:
489977.97
Organism:
2019-nCoV
Description:
P0DTC1
Residue:
4405
  
Inhibitor
Name:
BDBM510063
Synonyms:
N-[(2S)-1-({(1S)-1-Cyano-2-[(3S)-2-oxopyrrolidin-3-yl]ethyl}amino)-4-methyl-1- oxopentan-2-yl]-7-fluoro-4-methoxy-1H-indole-2-carboxamide (15) WO2021250648, Example 15
Type:
Small organic molecule
Emp. Form.:
C23H28FN5O4
Mol. Mass.:
457.4979
SMILES:
COc1ccc(F)c2[nH]c(cc12)C(=O)N[C@@H](CC(C)C)C(=O)N[C@@H](C[C@@H]1CCNC1=O)C#N
: