Target
Replicase polyprotein 1a
Ligand
BDBM510136
Substrate
Meas. Tech.
SARS-CoV-2 Coronavirus 3C Protease FRET Assay
Ki
6.00±n/a nM
Citation
 Owen, DRPettersson, MYReese, MRSammons, MFTuttle, JBVerhoest, PRWei, LYang, QYang, X Nitrile-containing antiviral compounds US Patent  US11351149 Publication Date 6/7/2022 
Target
Name:
Replicase polyprotein 1a
Synonyms:
ORF1a polyprotein Replicase polyprotein 1a pp1a
Type:
Protein
Mol. Mass.:
489977.97
Organism:
2019-nCoV
Description:
P0DTC1
Residue:
4405
  
Inhibitor
Name:
BDBM510136
Synonyms:
(1R,2S,5S)-N-{(1S)-1-Cyano-2-[(3S)-2-oxopyrrolidin-3-yl]ethyl}-3-[3-cyclobutyl-N- (trifluoroacetyl)-L-alanyl]-6,6-dimethyl-3-azabicyclo[3.1 0]hexane-2-carboxamide (88) WO2021250648, Example 88
Type:
Small organic molecule
Emp. Form.:
C24H32F3N5O4
Mol. Mass.:
511.5372
SMILES:
CC1(C)[C@H]2CN([C@@H]([C@@H]12)C(=O)N[C@@H](C[C@@H]1CCNC1=O)C#N)C(=O)[C@H](CC1CCC1)NC(=O)C(F)(F)F
: