Target
Dual specificity mitogen-activated protein kinase kinase 4
Ligand
BDBM558880
Substrate
Mitogen-activated protein kinase 14
Meas. Tech.
ADP-Glo Kinase Activity Assay
IC50
63.0±n/a nM
Citation
 Scheidt, KASchiltz, GEClutter, MRKwong, AJ 3-arylindazoles as selective MEK4 inhibitors US Patent  US11370770 Publication Date 6/28/2022 
Target
Name:
Dual specificity mitogen-activated protein kinase kinase 4
Synonyms:
JNK-activating kinase 1 JNKK1 MAP2K4 MKK4 PRKMK4 SEK1 SKK1 | c-Jun N-terminal kinase kinase 1
Type:
PROTEIN
Mol. Mass.:
44294.29
Organism:
Homo sapiens (Human)
Description:
ChEMBL_1460558
Residue:
399
  
Inhibitor
Name:
BDBM558880
Synonyms:
US11370770, Compound 6ee
Type:
Small organic molecule
Emp. Form.:
C14H9FN2O2
Mol. Mass.:
256.2319
SMILES:
Fc1ccc2c(n[nH]c2c1)-c1ccc2OCOc2c1
:
Substrate
Name:
Mitogen-activated protein kinase 14
Synonyms:
CSAID-binding protein CSBP1 CSPB1 MAP kinase 14 MAP kinase p38 alpha MAPK14 MK14_HUMAN Mitogen-activated protein kinase p38 alpha Stress-activated protein kinase 2a | p38 MAP kinase alpha/beta
Type:
Serine/threonine-protein kinase
Mol. Mass.:
41286.76
Organism:
Homo sapiens (Human)
Description:
Q16539
Residue:
360