Target
Dual specificity mitogen-activated protein kinase kinase 4
Ligand
BDBM558866
Substrate
Mitogen-activated protein kinase 8
Meas. Tech.
ADP-Glo Kinase Activity Assay
IC50
510±n/a nM
Citation
 Scheidt, KASchiltz, GEClutter, MRKwong, AJ 3-arylindazoles as selective MEK4 inhibitors US Patent  US11370770 Publication Date 6/28/2022 
Target
Name:
Dual specificity mitogen-activated protein kinase kinase 4
Synonyms:
JNK-activating kinase 1 JNKK1 MAP2K4 MKK4 PRKMK4 SEK1 SKK1 | c-Jun N-terminal kinase kinase 1
Type:
PROTEIN
Mol. Mass.:
44294.29
Organism:
Homo sapiens (Human)
Description:
ChEMBL_1460558
Residue:
399
  
Inhibitor
Name:
BDBM558866
Synonyms:
US11370770, Compound 6r
Type:
Small organic molecule
Emp. Form.:
C15H13N3O
Mol. Mass.:
251.2832
SMILES:
Cc1ccc2[nH]nc(-c3ccc(cc3)C(N)=O)c2c1
:
Substrate
Name:
Mitogen-activated protein kinase 8
Synonyms:
JNK-46 JNK1-alpha-1 MK08_HUMAN PRKM8 SAPK1C c-Jun N-terminal kinase 1 c-Jun N-terminal kinase 1(JNK1) | c-Jun N-terminal kinase 2 (JNK2)
Type:
Enzyme
Mol. Mass.:
48297.57
Organism:
Homo sapiens (Human)
Description:
JNK-1 was purchased from Upstate Cell Signaling Solutions (formerly Upstate Biotechnology).
Residue:
427