Target
Macrophage colony-stimulating factor 1 receptor
Ligand
BDBM164901
Substrate
Meas. Tech.
c-FMS Activity
IC50
2.00±n/a nM
Citation
 Kane, Jr., JLMatthews, GMetz, MKothe, MLiu, JScholte, A Tropomyosin-related kinase (TRK) inhibitors US Patent  US11406644 Publication Date 8/9/2022 
Target
Name:
Macrophage colony-stimulating factor 1 receptor
Synonyms:
CSF1R FMS Macrophage colony stimulating factor receptor Macrophage colony-stimulating factor 1 receptor (c-FMS) Proto-oncogene c-Fms c-fms | cFMS
Type:
Protein
Mol. Mass.:
107979.48
Organism:
Homo sapiens (Human)
Description:
P07333
Residue:
972
  
Inhibitor
Name:
BDBM164901
Synonyms:
US10166239, Ex. 3-15 US9067914, Ex. 3-15
Type:
Small organic molecule
Emp. Form.:
C26H26N6O3
Mol. Mass.:
470.523
SMILES:
COc1ccc(COc2ccc(Cn3c(N)nc4cc(cnc34)-c3cnn(C)c3)cc2OC)cc1
: