Target
UDP-3-O-acyl-N-acetylglucosamine deacetylase
Ligand
BDBM563144
Substrate
Meas. Tech.
LpxC Binding Assay
IC50
<10±n/a nM
Citation
 Teng, MNammalwar, BLi, XPerez, CYule, IFaulkner, AAtton, HParkes, AConvers-Reignier, SSouthey, MPuerta, DT Antibacterial compounds US Patent  US11407740 Publication Date 8/9/2022 
Target
Name:
UDP-3-O-acyl-N-acetylglucosamine deacetylase
Synonyms:
LPXC_ECOLI UDP-3-O-[3-hydroxymyristoyl] N-acetylglucosamine deacetylase (LxpC) asmB lpxC
Type:
Enzyme
Mol. Mass.:
33952.00
Organism:
Escherichia coli
Description:
P0A725
Residue:
305
  
Inhibitor
Name:
BDBM563144
Synonyms:
US11407740, Compound 17
Type:
Small organic molecule
Emp. Form.:
C29H33FN4O3
Mol. Mass.:
504.5957
SMILES:
C[C@H](CF)NCC(Cc1nc[nH]c(=O)c1O)c1ccc(cc1)C#Cc1ccc(CN2CCOCC2)cc1
: