Target
UDP-3-O-acyl-N-acetylglucosamine deacetylase
Ligand
BDBM563276
Substrate
Meas. Tech.
LpxC Binding Assay
IC50
30±n/a nM
Citation
 Teng, MNammalwar, BLi, XPerez, CYule, IFaulkner, AAtton, HParkes, AConvers-Reignier, SSouthey, MPuerta, DT Antibacterial compounds US Patent  US11407740 Publication Date 8/9/2022 
Target
Name:
UDP-3-O-acyl-N-acetylglucosamine deacetylase
Synonyms:
LPXC_ECOLI UDP-3-O-[3-hydroxymyristoyl] N-acetylglucosamine deacetylase (LxpC) asmB lpxC
Type:
Enzyme
Mol. Mass.:
33952.00
Organism:
Escherichia coli
Description:
P0A725
Residue:
305
  
Inhibitor
Name:
BDBM563276
Synonyms:
US11407740, Compound 194
Type:
Small organic molecule
Emp. Form.:
C24H26N4O4
Mol. Mass.:
434.4876
SMILES:
OCC(Cc1nc[nH]c(=O)c1O)c1ccc(cc1)C#Cc1cnn(CC2CCOCC2)c1
: