Target
UDP-3-O-acyl-N-acetylglucosamine deacetylase
Ligand
BDBM563284
Substrate
Meas. Tech.
LpxC Binding Assay
IC50
75±n/a nM
Citation
 Teng, MNammalwar, BLi, XPerez, CYule, IFaulkner, AAtton, HParkes, AConvers-Reignier, SSouthey, MPuerta, DT Antibacterial compounds US Patent  US11407740 Publication Date 8/9/2022 
Target
Name:
UDP-3-O-acyl-N-acetylglucosamine deacetylase
Synonyms:
LPXC_ECOLI UDP-3-O-[3-hydroxymyristoyl] N-acetylglucosamine deacetylase (LxpC) asmB lpxC
Type:
Enzyme
Mol. Mass.:
33952.00
Organism:
Escherichia coli
Description:
P0A725
Residue:
305
  
Inhibitor
Name:
BDBM563284
Synonyms:
US11407740, Compound 208
Type:
Small organic molecule
Emp. Form.:
C23H24FN5O3
Mol. Mass.:
437.4668
SMILES:
Oc1c(CC(CNCCF)c2ccc(cc2)C#Cc2cnn(c2)C2COC2)nc[nH]c1=O
: