Target
cAMP and cAMP-inhibited cGMP 3',5'-cyclic phosphodiesterase 10A
Ligand
BDBM563697
Substrate
Meas. Tech.
PDE10A assay
IC50
0.30±n/a nM
Citation
 Tosstorff, ARudolph, MGCole, JCReutlinger, MKramer, CSchaffhauser, HNilly, AFlohr, AKuhn, B A high quality, industrial data set for binding affinity prediction: performance comparison in different early drug discovery scenarios. J Comput Aided Mol Des 36:753-765 (2022)  
Target
Name:
cAMP and cAMP-inhibited cGMP 3',5'-cyclic phosphodiesterase 10A
Synonyms:
3',5'-cyclic phosphodiesterase PDE10_HUMAN Phosphodiesterase 10A
Type:
Protein
Mol. Mass.:
88412.52
Organism:
Homo sapiens (Human)
Description:
Q9Y233
Residue:
779
  
Inhibitor
Name:
BDBM563697
Synonyms:
Roche-Dataset for PDE10A, Compound 11
Type:
Small Organic Molecule
Emp. Form.:
C24H24FN7O3
Mol. Mass.:
477.4909
SMILES:
Cn1ncc(C(=O)N2CCC2)c1C(=O)Nc1ccn2nc(nc2c1)-c1ccccc1OCCCF
: