Target
cAMP and cAMP-inhibited cGMP 3',5'-cyclic phosphodiesterase 10A
Ligand
BDBM125040
Substrate
Meas. Tech.
PDE10A assay
IC50
0.51±n/a nM
Citation
 Tosstorff, ARudolph, MGCole, JCReutlinger, MKramer, CSchaffhauser, HNilly, AFlohr, AKuhn, B A high quality, industrial data set for binding affinity prediction: performance comparison in different early drug discovery scenarios. J Comput Aided Mol Des 36:753-765 (2022)  
Target
Name:
cAMP and cAMP-inhibited cGMP 3',5'-cyclic phosphodiesterase 10A
Synonyms:
3',5'-cyclic phosphodiesterase PDE10_HUMAN Phosphodiesterase 10A
Type:
Protein
Mol. Mass.:
88412.52
Organism:
Homo sapiens (Human)
Description:
Q9Y233
Residue:
779
  
Inhibitor
Name:
BDBM125040
Synonyms:
Roche-Dataset for PDE10A, Compound 21 | US8772510, 59
Type:
Small organic molecule
Emp. Form.:
C24H24N8O2
Mol. Mass.:
456.4998
SMILES:
Cn1ncc(C(=O)N2CCC2)c1C(=O)NCCc1nc(nn1-c1cccnc1)-c1ccccc1
: