Target
cAMP and cAMP-inhibited cGMP 3',5'-cyclic phosphodiesterase 10A
Ligand
BDBM97527
Substrate
Meas. Tech.
PDE10A assay
IC50
0.18±n/a nM
Citation
 Tosstorff, ARudolph, MGCole, JCReutlinger, MKramer, CSchaffhauser, HNilly, AFlohr, AKuhn, B A high quality, industrial data set for binding affinity prediction: performance comparison in different early drug discovery scenarios. J Comput Aided Mol Des 36:753-765 (2022)  
Target
Name:
cAMP and cAMP-inhibited cGMP 3',5'-cyclic phosphodiesterase 10A
Synonyms:
3',5'-cyclic phosphodiesterase PDE10_HUMAN Phosphodiesterase 10A
Type:
Protein
Mol. Mass.:
88412.52
Organism:
Homo sapiens (Human)
Description:
Q9Y233
Residue:
779
  
Inhibitor
Name:
BDBM97527
Synonyms:
Roche-Dataset for PDE10A, Compound 53 | US8470820, 38
Type:
Small organic molecule
Emp. Form.:
C24H24N8O2
Mol. Mass.:
456.4998
SMILES:
COCCn1nc(cc1NC(=O)c1nc(ccc1Nc1cncnc1)C1CC1)-c1ccccn1
: