Target
cAMP and cAMP-inhibited cGMP 3',5'-cyclic phosphodiesterase 10A
Ligand
BDBM563870
Substrate
Meas. Tech.
PDE10A assay
IC50
0.22±n/a nM
Citation
 Tosstorff, ARudolph, MGCole, JCReutlinger, MKramer, CSchaffhauser, HNilly, AFlohr, AKuhn, B A high quality, industrial data set for binding affinity prediction: performance comparison in different early drug discovery scenarios. J Comput Aided Mol Des 36:753-765 (2022)  
Target
Name:
cAMP and cAMP-inhibited cGMP 3',5'-cyclic phosphodiesterase 10A
Synonyms:
3',5'-cyclic phosphodiesterase PDE10_HUMAN Phosphodiesterase 10A
Type:
Protein
Mol. Mass.:
88412.52
Organism:
Homo sapiens (Human)
Description:
Q9Y233
Residue:
779
  
Inhibitor
Name:
BDBM563870
Synonyms:
Roche-Dataset for PDE10A, Compound 184
Type:
Small Organic Molecule
Emp. Form.:
C28H24N8O2
Mol. Mass.:
504.5426
SMILES:
CNC(=O)c1cn2cc(nc2cc1NC(=O)c1nc(ccc1Nc1cncnc1)C1CC1)-c1ccccc1
: