Target
cAMP and cAMP-inhibited cGMP 3',5'-cyclic phosphodiesterase 10A
Ligand
BDBM563881
Substrate
Meas. Tech.
PDE10A assay
IC50
0.36±n/a nM
Citation
 Tosstorff, ARudolph, MGCole, JCReutlinger, MKramer, CSchaffhauser, HNilly, AFlohr, AKuhn, B A high quality, industrial data set for binding affinity prediction: performance comparison in different early drug discovery scenarios. J Comput Aided Mol Des 36:753-765 (2022)  
Target
Name:
cAMP and cAMP-inhibited cGMP 3',5'-cyclic phosphodiesterase 10A
Synonyms:
3',5'-cyclic phosphodiesterase PDE10_HUMAN Phosphodiesterase 10A
Type:
Protein
Mol. Mass.:
88412.52
Organism:
Homo sapiens (Human)
Description:
Q9Y233
Residue:
779
  
Inhibitor
Name:
BDBM563881
Synonyms:
Roche-Dataset for PDE10A, Compound 195
Type:
Small Organic Molecule
Emp. Form.:
C21H20N6O2
Mol. Mass.:
388.4225
SMILES:
CN(C)C(=O)c1cnn(C)c1C(=O)Nc1ccc2[nH]c(nc2c1)-c1ccccc1
: