Target
Gag-Pol polyprotein
Ligand
BDBM567108
Substrate
Meas. Tech.
Anti-HIV-1 Activity Test
EC50
9.00±n/a nM
Citation
 He, YZhang, HZheng, YZhang, YTang, CDing, WYang, LLi, Y DACOS type NNRTIS amino acid ester derivative, preparation method thereof, pharmaceutical composition, and application thereof US Patent  US11420959 Publication Date 8/23/2022 
Target
Name:
Gag-Pol polyprotein
Synonyms:
POL_HV1LW gag-pol
Type:
Protein
Mol. Mass.:
162115.08
Organism:
HIV-1
Description:
P0C6F2
Residue:
1435
  
Inhibitor
Name:
BDBM567108
Synonyms:
US11420959, Example I-7
Type:
Small organic molecule
Emp. Form.:
C30H35N3O4S
Mol. Mass.:
533.682
SMILES:
CCc1c(CC2CCCCC2)nc(SCC(=O)c2ccc(OC(=O)C(N)Cc3ccccc3)cc2)[nH]c1=O
: